{"text_format":"1","workbook":"xlsx","n_sheets":7,"sheets":["Vejledning","Oplysninger","Beregninger","Udskrift","Transport","Datagrundlag","Fraktilgrupper"],"not_rendered":{"charts":2,"images":0,"macros":1,"external_links":0,"defined_names":280,"comments":1,"pivot_tables":0},"unopened":[],"bounds":{"document_bytes":16777216,"sheet_cells":100000,"rows_first":2000,"rows_last":500,"rows_between":2000,"halvings":0,"cell_chars":16384,"cell_head_chars":4096},"cells_cut":0,"cells_raw":0,"read":"whole","date_system":"1900"}

{"sheet":"Vejledning","index":0,"n_rows":38,"n_cols":10,"rows_kept":38,"cut":false,"hidden":false,"merged":[[24,1,24,14],[25,1,27,14],[29,1,30,14],[35,1,36,14],[3,1,8,5],[9,9,12,12],[14,9,14,13],[13,9,13,13],[13,1,14,5],[16,1,17,5],[10,1,11,5]]}
[]
[null,"Forpagtningsberegningsmodel"]
[]
[null,"Med dette regneark kan man beregne økonomien ved tilforpagtning eller bortforpagtning afhængig af forventet afgrødesammensætning, priser og omkostningsniveauer mv. Værdier fra gældende afgrødekalkuler foreslås som standard i beregningen. Der er mulighed for at sammenligne med faktiske forpagtningspriser i 2019 pr. driftsgren, JB-type og landsdel.",null,null,null,null,null,null,"Udgiver:","SEGES"]
[null,null,null,null,null,null,null,null,null,"Erhvervsøkonomi"]
[null,null,null,null,null,null,null,null,"Udgivelsesdato:","2020-12-01"]
[null,null,null,null,null,null,null,null,"Forfatter:","Morten Nyland Christensen og Ove Lund"]
[null,null,null,null,null,null,null,null,"Version:","4.0"]
[]
[null,null,null,null,null,null,null,null,"Datagrundlag:","Afgrødekalkuler fra FarmtalOnline, og forpagtningspriser 2019 fra økonomidatabasen kombineret med udvalgte oplysninger fra Dansk Markdatabase."]
{"$rows_left_out":29}
{"sheet":"Oplysninger","index":1,"n_rows":36,"n_cols":17,"rows_kept":36,"cut":false,"hidden":false,"merged":[[18,7,23,7],[33,1,34,7],[35,1,36,7],[2,3,2,5],[29,1,29,2]]}
[]
[]
[null,null,null,"Oplysninger i mørkeblå felter stammer fra regnskabet. Kan overskrives via de lyseblå felter til højre for. De grønne celler er der en drop down boks, der kan vælges oplysninger til.",null,null,null,null,null,"Celler som skal skjules"]
[]
[null,"Oplysninger om bedrift og forpagtning"]
[]
[null,"Basisoplysninger"]
[null,"CVR.nr.",null,{"$f":"IF(F8<>\"\",F8,J8)","v":38264125},null,38264125,null,null,null,{"$f":"IFERROR(VLOOKUP(L8,#REF!,7,FALSE),\"\")","v":""},null,6425]
[null,"Forpagtet areal (ha)?",null,{"$f":"IF(F9<>\"\",F9,J9)","v":97},null,97,null,null,null,{"$f":"IFERROR(VLOOKUP(L9,#REF!,7,FALSE),\"\")","v":""},null,3911]
[null,"Jordbonitet?",null,{"$f":"IF(F10<>\"\",F10,IF(J10=1,Datagrundlag!C8,IF(J10=2,Datagrundlag!C7,IF(J10=5,Datagrundlag!C6,\"\"))))","v":"sandjord med vanding"},null,"sandjord med vanding",null,null,null,{"$f":"IFERROR(VLOOKUP(L10,#REF!,7,FALSE),\"\")","v":""},null,"JB_type","sandjord m vand = 1 sandjord u vand = 2 lerjord = 5"]
{"$rows_left_out":27}
{"sheet":"Beregninger","index":2,"n_rows":75,"n_cols":16,"rows_kept":75,"cut":false,"hidden":false,"merged":[[25,18,30,18],[42,17,47,17],[34,17,39,17],[34,18,39,18],[42,18,47,18],[25,17,30,17],[74,1,74,24],[34,1,35,1],[45,3,45,4],[46,3,46,4],[47,3,47,4],[42,3,42,4],[43,3,43,4],[44,3,44,4],[57,1,57,9],[63,1,63,9],[71,1,71,9],[43,9,46,9],[35,9,38,9]]}
[null,"Beregning af pris for forpagtning"]
[null,null,null,null,null,"Kalkule/egne","Enhed","Egne værdier",null,null,null,null,null,"Skjules",null,"Skjules"]
[]
[null,"Bruttoudbytte"]
[null,"Udbytter:",{"$f":"IF(Oplysninger!C19=\"Ingen eller andet\",\"\",Oplysninger!C19)","v":"Vårbyg"},{"$f":"IF(OR(Oplysninger!C19=\"Ingen eller andet\",Oplysninger!C19=\"\"),\"\",Oplysninger!C19&\" på \"&Oplysninger!D$10&Oplysninger!J$11)","v":"Vårbyg på sandjord med vanding med gylle"},null,{"$f":"IF(H5=\"\",N5,H5)","v":60},{"$f":"IF(Oplysninger!$C19=\"Majs til helsæd\",\"FEN pr. ha\",IF(Oplysninger!$C19=\"Slætgræs 4 slæt\",\"FEN pr. ha\",\"hkg. pr. ha\"))","v":"hkg. pr. ha"},null,null,{"$f":"IFERROR(_xlfn.IFS(AND(D5<>\"\",F5=0),\"ingen kalkule, intast egen værdi\",D5=\"\",\"Vælge afgrøde, hvis ønsket\"),\"\")","v":""},null,null,null,{"$f":"IF(ISNUMBER(P5),P5,0)","v":60},null,{"$f":"VLOOKUP(D5,Datagrundlag!C$70:E$153,2,FALSE)","v":60}]
[null,null,{"$f":"IF(Oplysninger!C20=\"Ingen eller andet\",\"\",Oplysninger!C20)","v":"Vinterhvede"},{"$f":"IF(OR(Oplysninger!C20=\"Ingen eller andet\",Oplysninger!C20=\"\"),\"\",Oplysninger!C20&\" på \"&Oplysninger!D$10&Oplysninger!J$11)","v":"Vinterhvede på sandjord med vanding med gylle"},null,84,{"$f":"IF(Oplysninger!$C20=\"Majs til helsæd\",\"FEN pr. ha\",IF(Oplysninger!$C20=\"Slætgræs 4 slæt\",\"FEN pr. ha\",\"hkg. pr. ha\"))","v":"hkg. pr. ha"},null,null,{"$f":"IFERROR(_xlfn.IFS(AND(D6<>\"\",F6=0),\"ingen kalkule, intast egen værdi\",D6=\"\",\"Vælge afgrøde, hvis ønsket\"),\"\")","v":""},null,null,null,{"$f":"IF(ISNUMBER(P6),P6,0)","v":84},null,{"$f":"VLOOKUP(D6,Datagrundlag!C$70:F$153,2,FALSE)","v":84}]
[null,null,{"$f":"IF(Oplysninger!C21=\"Ingen eller andet\",\"\",Oplysninger!C21)","v":"Vinterraps"},{"$f":"IF(OR(Oplysninger!C21=\"Ingen eller andet\",Oplysninger!C21=\"\"),\"\",Oplysninger!C21&\" på \"&Oplysninger!D$10&Oplysninger!J$11)","v":"Vinterraps på sandjord med vanding med gylle"},null,40,{"$f":"IF(Oplysninger!$C21=\"Majs til helsæd\",\"FEN pr. ha\",IF(Oplysninger!$C21=\"Slætgræs 4 slæt\",\"FEN pr. ha\",\"hkg. pr. ha\"))","v":"hkg. pr. ha"},null,null,{"$f":"IFERROR(_xlfn.IFS(AND(D7<>\"\",F7=0),\"ingen kalkule, intast egen værdi\",D7=\"\",\"Vælge afgrøde, hvis ønsket\"),\"\")","v":""},null,null,null,40,null,{"$f":"VLOOKUP(D7,Datagrundlag!C$70:F$153,2,FALSE)","v":40}]
[null,null,{"$f":"IF(Oplysninger!C22=\"Ingen eller andet\",\"\",Oplysninger!C22)","v":"Majs til helsæd"},{"$f":"IF(OR(Oplysninger!C22=\"Ingen eller andet\",Oplysninger!C22=\"\"),\"\",Oplysninger!C22&\" på \"&Oplysninger!D$10&Oplysninger!J$11)","v":"Majs til helsæd på sandjord med vanding med gylle"},null,11800,{"$f":"IF(Oplysninger!$C22=\"Majs til helsæd\",\"FEN pr. ha\",IF(Oplysninger!$C22=\"Slætgræs 4 slæt\",\"FEN pr. ha\",\"hkg. pr. ha\"))","v":"FEN pr. ha"},null,null,{"$f":"IFERROR(_xlfn.IFS(AND(D8<>\"\",F8=0),\"ingen kalkule, intast egen værdi\",D8=\"\",\"Vælge afgrøde, hvis ønsket\"),\"\")","v":""},null,null,null,11800,null,{"$f":"VLOOKUP(D8,Datagrundlag!C$70:F$153,2,FALSE)","v":11800}]
[null,null,{"$f":"IF(Oplysninger!C23=\"Ingen eller andet\",\"\",Oplysninger!C23)","v":"Fabriksroer"},{"$f":"IF(OR(Oplysninger!C23=\"Ingen eller andet\",Oplysninger!C23=\"\"),\"\",Oplysninger!C23&\" på \"&Oplysninger!D$10&Oplysninger!J$11)","v":"Fabriksroer på sandjord med vanding med gylle"},null,0,{"$f":"IF(Oplysninger!$C23=\"Majs til helsæd\",\"FEN pr. ha\",IF(Oplysninger!$C23=\"Slætgræs 4 slæt\",\"FEN pr. ha\",\"hkg. pr. ha\"))","v":"hkg. pr. ha"},null,null,{"$f":"IFERROR(_xlfn.IFS(AND(D9<>\"\",F9=0),\"ingen kalkule, intast egen værdi\",D9=\"\",\"Vælge afgrøde, hvis ønsket\"),\"\")","v":"ingen kalkule, intast egen værdi"},null,null,null,0,null,{"$f":"VLOOKUP(D9,Datagrundlag!C$70:F$153,2,FALSE)","v":0}]
[null,null,{"$f":"IF(Oplysninger!C24=\"Ingen eller andet\",\"\",Oplysninger!C24)","v":"Slætgræs 4 slæt"},{"$f":"IF(OR(Oplysninger!C24=\"Ingen eller andet\",Oplysninger!C24=\"\"),\"\",Oplysninger!C24&\" på \"&Oplysninger!D$10&Oplysninger!J$11)","v":"Slætgræs 4 slæt på sandjord med vanding med gylle"},null,10100,{"$f":"IF(Oplysninger!$C24=\"Majs til helsæd\",\"FEN pr. ha\",IF(Oplysninger!$C24=\"Slætgræs 4 slæt\",\"FEN pr. ha\",\"hkg. pr. ha\"))","v":"FEN pr. ha"},null,null,{"$f":"IFERROR(_xlfn.IFS(AND(D10<>\"\",F10=0),\"ingen kalkule, intast egen værdi\",D10=\"\",\"Vælge afgrøde, hvis ønsket\"),\"\")","v":""},null,null,null,10100,null,{"$f":"VLOOKUP(D10,Datagrundlag!C$70:F$153,2,FALSE)","v":10100}]
{"$rows_left_out":66}
{"sheet":"Udskrift","index":3,"n_rows":59,"n_cols":10,"rows_kept":59,"cut":false,"hidden":false,"merged":[[41,1,41,3],[15,4,15,5],[16,4,16,5],[17,4,17,5],[18,4,18,5],[19,4,19,5]]}
[]
[null,"Resultat og sammenligning"]
[]
[null,{"$f":"Beregninger!B23","v":"Bruttoudbytte i alt (vægtet gennemsnit)"},null,null,null,{"$f":"IF(B4=Beregninger!B23,Beregninger!F23,\"\")","v":7585}]
[null,{"$f":"Beregninger!B32","v":"Stykomkostninger (vægtet gennemsnit)*"},null,null,null,{"$f":"IF(B5=Beregninger!B32,Beregninger!F32,\"\")","v":-1770.95}]
[null,{"$f":"Beregninger!B33","v":"Dækningsbidrag"},null,null,null,{"$f":"IF(B6=Beregninger!B33,Beregninger!F33,\"\")","v":7201.55}]
[null,{"$f":"Beregninger!B42","v":"Maskinomkostninger inkl. arbejde (korrigeret for arbejdstid og kapacitet)"},null,null,null,{"$f":"IF(B7=Beregninger!B42,Beregninger!F42,\"\")","v":-6427.8160000000007}]
[null,{"$f":"Beregninger!B49","v":"Transportomkostninger (vægtet gennemsnit)"},null,null,null,{"$f":"IF(B8=Beregninger!B49,Beregninger!F49,\"\")","v":-168.55670103092785}]
[null,{"$f":"Beregninger!B51","v":"Andre omkostninger **"},null,null,null,{"$f":"IF(B9=Beregninger!B51,Beregninger!F51,\"\")","v":-500}]
[null,{"$f":"Beregninger!B52","v":"Rest til forpagtning ekskl. EU-støtte"},null,null,null,{"$f":"IF(B10=Beregninger!B52,Beregninger!F52,\"\")","v":105.17729896907167}]
{"$rows_left_out":50}
{"sheet":"Transport","index":4,"n_rows":55,"n_cols":32,"rows_kept":55,"cut":false,"hidden":false,"merged":[[2,1,4,1],[2,2,2,3],[2,4,2,5],[2,6,2,7],[2,8,2,9],[30,12,31,13],[2,12,2,13],[3,2,3,3],[3,4,3,5],[3,6,3,7],[3,8,3,9],[3,10,3,11],[3,12,3,13],[2,10,2,11]]}
[null,"Beregning af tid og omkostninger til transport til forpagtet areal"]
[]
[null,"Antal transporter til og fra forpagtet areal",{"$f":"IF(Oplysninger!$C19=\"Ingen eller andet\",Beregninger!D11,Oplysninger!$C19)","v":"Vårbyg"},null,{"$f":"IF(Oplysninger!$C20=\"Ingen eller andet\",Beregninger!D12,Oplysninger!$C20)","v":"Vinterhvede"},null,{"$f":"IF(Oplysninger!$C21=\"Ingen eller andet\",Beregninger!D13,Oplysninger!$C21)","v":"Vinterraps"},null,{"$f":"IF(Oplysninger!$C22=\"Ingen eller andet\",Beregninger!D14,Oplysninger!$C22)","v":"Majs til helsæd"},null,{"$f":"IF(Oplysninger!$C23=\"Ingen eller andet\",Beregninger!D15,Oplysninger!$C23)","v":"Fabriksroer"},null,{"$f":"IF(Oplysninger!$C24=\"Ingen eller andet\",Beregninger!D16,Oplysninger!$C24)","v":"Slætgræs 4 slæt"}]
[null,null,{"$f":"_xlfn.CONCAT(\"Antal ha: \",TEXT(Oplysninger!$D9*Oplysninger!$D19,\"#.##0,0\"))","v":"Antal ha: 24,3"},null,{"$f":"_xlfn.CONCAT(\"Antal ha: \",TEXT(Oplysninger!$D9*Oplysninger!$D20,\"#.##0,0\"))","v":"Antal ha: 48,5"},null,{"$f":"_xlfn.CONCAT(\"Antal ha: \",TEXT(Oplysninger!$D9*Oplysninger!$D21,\"#.##0,0\"))","v":"Antal ha: 9,7"},null,{"$f":"_xlfn.CONCAT(\"Antal ha: \",TEXT(Oplysninger!$D9*Oplysninger!$D22,\"#.##0,0\"))","v":"Antal ha: 14,6"},null,{"$f":"_xlfn.CONCAT(\"Antal ha: \",TEXT(Oplysninger!$D9*Oplysninger!$D23,\"#.##0,0\"))","v":"Antal ha: 0,0"},null,{"$f":"_xlfn.CONCAT(\"Antal ha: \",TEXT(Oplysninger!$D9*Oplysninger!$D24,\"#.##0,0\"))","v":"Antal ha: 0,0"},null,null,null,null,"Budgetkalkuler (opdateres når behov opstår)"]
[null,null,"Egen vurdering (alle ha)","Budget-kalkule\n(alle ha) ","Egen vurdering (alle ha)","Budget-kalkule\n(alle ha) ","Egen vurdering (alle ha)","Budget-kalkule\n(alle ha) ","Egen vurdering (alle ha)","Budget-kalkule\n(alle ha) ","Egen vurdering (alle ha)","Budget-kalkule\n(alle ha) ","Egen vurdering (alle ha)","Budget-kalkule\n(alle ha) ",null,null,null,"Vårbyg","Vinterrug","Havre","Vinterhvede","Vinterraps","Vinterbyg","Majs til helsæd","Fabriksroer","Stivelseskartofler","Læggekartofler","Spisekartofler","Proceskartofler","Alm. rajgræs","Slætgræs 4 slæt","Ingen eller andet"]
[null,"Plov og jordpakker (1)",null,{"$f":"IF(C6=\"\",ROUNDUP(HLOOKUP(Oplysninger!$C$19,Transport!$R$5:$AF$26,2,)*Oplysninger!$D$9*Oplysninger!$D$19/$I31,0),0)","v":2},null,{"$f":"IF(E6=\"\",ROUNDUP(HLOOKUP(Oplysninger!$C$20,Transport!$R$5:$AF$26,2,)*Oplysninger!$D$9*Oplysninger!$D$20/$I31,0),0)","v":3},null,{"$f":"IF(G6=\"\",ROUNDUP(HLOOKUP(Oplysninger!$C$21,Transport!$R$5:$AF$26,2,)*Oplysninger!$D$9*Oplysninger!$D$21/$I31,0),0)","v":1},null,{"$f":"IF(I6=\"\",ROUNDUP(HLOOKUP(Oplysninger!$C$22,Transport!$R$5:$AF$26,2,)*Oplysninger!$D$9*Oplysninger!$D$22/$I31,0),0)","v":1},null,{"$f":"IF(K6=\"\",ROUNDUP(HLOOKUP(Oplysninger!$C$23,Transport!$R$5:$AF$26,2,)*Oplysninger!$D$9*Oplysninger!$D$23/$I31,0),0)","v":0},null,{"$f":"IF(M6=\"\",ROUNDUP(HLOOKUP(Oplysninger!$C$24,Transport!$R$5:$AF$26,2,)*Oplysninger!$D$9*Oplysninger!$D$24/$I31,0),0)","v":0},null,"Plov og jordpakker",null,1,1,1,1,1,1,1,1,1,1,1,1]
[null,"Stensamling",null,{"$f":"IF(C7=\"\",HLOOKUP(Oplysninger!$C$19,Transport!$R$5:$AF$26,3,),0)","v":0},null,{"$f":"IF(E7=\"\",HLOOKUP(Oplysninger!$C$20,Transport!$R$5:$AF$26,3,),0)","v":0},null,{"$f":"IF(G7=\"\",HLOOKUP(Oplysninger!$C$21,Transport!$R$5:$AF$26,3,),0)","v":0},null,{"$f":"IF(I7=\"\",HLOOKUP(Oplysninger!$C$22,Transport!$R$5:$AF$26,3,),0)","v":0},null,{"$f":"IF(K7=\"\",HLOOKUP(Oplysninger!$C$23,Transport!$R$5:$AF$26,3,),0)","v":0},null,{"$f":"IF(M7=\"\",HLOOKUP(Oplysninger!$C$24,Transport!$R$5:$AF$26,3,),0)","v":0},null,"Stensamling"]
[null,"Tromle (2)",null,{"$f":"IF(C8=\"\",ROUNDUP(HLOOKUP(Oplysninger!$C$19,Transport!$R$5:$AF$26,4,)*Oplysninger!$D$9*Oplysninger!$D$19/$I32,0),0)","v":0},null,{"$f":"IF(E8=\"\",ROUNDUP(HLOOKUP(Oplysninger!$C$20,Transport!$R$5:$AF$26,4,)*Oplysninger!$D$9*Oplysninger!$D$20/$I32,0),0)","v":0},null,{"$f":"IF(G8=\"\",ROUNDUP(HLOOKUP(Oplysninger!$C$21,Transport!$R$5:$AF$26,4,)*Oplysninger!$D$9*Oplysninger!$D$21/$I32,0),0)","v":0},null,{"$f":"IF(I8=\"\",ROUNDUP(HLOOKUP(Oplysninger!$C$22,Transport!$R$5:$AF$26,4,)*Oplysninger!$D$9*Oplysninger!$D$22/$I32,0),0)","v":1},null,{"$f":"IF(K8=\"\",ROUNDUP(HLOOKUP(Oplysninger!$C$23,Transport!$R$5:$AF$26,4,)*Oplysninger!$D$9*Oplysninger!$D$23/$I32,0),0)","v":0},null,{"$f":"IF(M8=\"\",ROUNDUP(HLOOKUP(Oplysninger!$C$24,Transport!$R$5:$AF$26,4,)*Oplysninger!$D$9*Oplysninger!$D$24/$I32,0),0)","v":0},null,"Tromle",null,null,null,null,null,null,null,{"$f":"X7+1","v":1},null,null,null,null,{"$f":"AC7+1","v":1}]
[null,"Kombihavning og såning (3)",null,{"$f":"IF(C9=\"\",ROUNDUP(HLOOKUP(Oplysninger!$C$19,Transport!$R$5:$AF$26,5,)*Oplysninger!$D$9*Oplysninger!$D$19/$I33,0),0)","v":1},null,{"$f":"IF(E9=\"\",ROUNDUP(HLOOKUP(Oplysninger!$C$20,Transport!$R$5:$AF$26,5,)*Oplysninger!$D$9*Oplysninger!$D$20/$I33,0),0)","v":1},null,{"$f":"IF(G9=\"\",ROUNDUP(HLOOKUP(Oplysninger!$C$21,Transport!$R$5:$AF$26,5,)*Oplysninger!$D$9*Oplysninger!$D$21/$I33,0),0)","v":1},null,{"$f":"IF(I9=\"\",ROUNDUP(HLOOKUP(Oplysninger!$C$22,Transport!$R$5:$AF$26,5,)*Oplysninger!$D$9*Oplysninger!$D$22/$I33,0),0)","v":0},null,{"$f":"IF(K9=\"\",ROUNDUP(HLOOKUP(Oplysninger!$C$23,Transport!$R$5:$AF$26,5,)*Oplysninger!$D$9*Oplysninger!$D$23/$I33,0),0)","v":0},null,{"$f":"IF(M9=\"\",ROUNDUP(HLOOKUP(Oplysninger!$C$24,Transport!$R$5:$AF$26,5,)*Oplysninger!$D$9*Oplysninger!$D$24/$I33,0),0)","v":0},null,"Kombihavning og såning",null,1,1,1,1,1,1,null,1,1,{"$f":"AA8+1","v":1},{"$f":"AB8+1","v":1},1,1]
[null,"Udsæd (4)",null,{"$f":"IF(C10=\"\",ROUNDUP(200*Oplysninger!$D$9*Oplysninger!$D19/$I34,0),0)","v":1},null,{"$f":"IF(E10=\"\",ROUNDUP(200*Oplysninger!$D$9*Oplysninger!$D20/$I34,0),0)","v":1},null,{"$f":"IF(G10=\"\",ROUNDUP(200*Oplysninger!$D$9*Oplysninger!$D21/$I34,0),0)","v":1},0,{"$f":"IF(I10=\"\",ROUNDUP(200*Oplysninger!$D$9*Oplysninger!$D22/$I34,0),0)","v":0},null,{"$f":"IF(K10=\"\",ROUNDUP(200*Oplysninger!$D$9*Oplysninger!$D23/$I34,0),0)","v":0},null,{"$f":"IF(M10=\"\",ROUNDUP(200*Oplysninger!$D$9*Oplysninger!$D24/$I34,0),0)","v":0},null,"Udsæd*"]
{"$rows_left_out":46}
{"sheet":"Datagrundlag","index":5,"n_rows":257,"n_cols":6,"rows_kept":257,"cut":false,"hidden":false,"merged":[]}
[null,null,"DATAGRUNDLAG (budgetkalkuler okt. 2020 for 2021)"]
[null,null,"Opdateret 21.10.2020 ovl"]
[null,null,null,null,"Valgfelt (ja/nej)"]
[null,null,"Jordbund",null,null,"Ja"]
[null,null,null,null,null,"Nej"]
[null,null,"lerjord"]
[null,null,"sandjord uden vanding",null,"Opdateres årligt efter budgetkalkulerne i FarmtalOnline"]
[null,null,"sandjord med vanding",null,"Priser","Kr. pr. hkg."]
[null,null,null,null,"Byg",109]
[null,null,"Faste specifikationer (opdateres ikke)",null,"Hvede",115]
{"$rows_left_out":248}
{"sheet":"Fraktilgrupper","index":6,"n_rows":87,"n_cols":17,"rows_kept":87,"cut":false,"hidden":true,"merged":[]}
["Landsdel","type","FTO_jb","FTO_jbx","x.Antal","x.MQ00_20","x.MQ00_20x","x.MQ20_40","x.MQ20_40x","x.MQ40_60","x.MQ40_60x","x.MQ60_80","x.MQ60_80x","x.MQ80_100","x.MQ80_100x","Dummy 1","Dummy2"]
["Lolland-Falster","Husdyrproduktion","2",{"$f":"_xlfn.IFS(Tabel1[[#This Row],[FTO_jb]]=\"1\",\"JB1&3\",Tabel1[[#This Row],[FTO_jb]]=\"2\",\"JB2&4\",Tabel1[[#This Row],[FTO_jb]]=\"3\",\"JB5&6\",Tabel1[[#This Row],[FTO_jb]]=\"4\",\"JB7&8\",Tabel1[[#This Row],[FTO_jb]]=\"Alle\",Tabel1[[#This Row],[FTO_jb]])","v":"JB2&4"},2,"NaN",{"$f":"IF(Tabel1[[#This Row],[x.MQ00_20]]=\"NaN\",\"\",VALUE(Tabel1[[#This Row],[x.MQ00_20]]))","v":""},"NaN",{"$f":"IF(Tabel1[[#This Row],[x.MQ20_40]]=\"NaN\",\"\",VALUE(Tabel1[[#This Row],[x.MQ20_40]]))","v":""},"NaN",{"$f":"IF(Tabel1[[#This Row],[x.MQ40_60]]=\"NaN\",\"\",VALUE(Tabel1[[#This Row],[x.MQ40_60]]))","v":""},"NaN",{"$f":"IF(Tabel1[[#This Row],[x.MQ60_80]]=\"NaN\",\"\",VALUE(Tabel1[[#This Row],[x.MQ60_80]]))","v":""},"NaN",{"$f":"IF(Tabel1[[#This Row],[x.MQ80_100]]=\"NaN\",\"\",VALUE(Tabel1[[#This Row],[x.MQ80_100]]))","v":""}]
["Lolland-Falster","Husdyrproduktion","3",{"$f":"_xlfn.IFS(Tabel1[[#This Row],[FTO_jb]]=\"1\",\"JB1&3\",Tabel1[[#This Row],[FTO_jb]]=\"2\",\"JB2&4\",Tabel1[[#This Row],[FTO_jb]]=\"3\",\"JB5&6\",Tabel1[[#This Row],[FTO_jb]]=\"4\",\"JB7&8\",Tabel1[[#This Row],[FTO_jb]]=\"Alle\",Tabel1[[#This Row],[FTO_jb]])","v":"JB5&6"},23,"NaN",{"$f":"IF(Tabel1[[#This Row],[x.MQ00_20]]=\"NaN\",\"\",VALUE(Tabel1[[#This Row],[x.MQ00_20]]))","v":""},"NaN",{"$f":"IF(Tabel1[[#This Row],[x.MQ20_40]]=\"NaN\",\"\",VALUE(Tabel1[[#This Row],[x.MQ20_40]]))","v":""},"NaN",{"$f":"IF(Tabel1[[#This Row],[x.MQ40_60]]=\"NaN\",\"\",VALUE(Tabel1[[#This Row],[x.MQ40_60]]))","v":""},"NaN",{"$f":"IF(Tabel1[[#This Row],[x.MQ60_80]]=\"NaN\",\"\",VALUE(Tabel1[[#This Row],[x.MQ60_80]]))","v":""},"NaN",{"$f":"IF(Tabel1[[#This Row],[x.MQ80_100]]=\"NaN\",\"\",VALUE(Tabel1[[#This Row],[x.MQ80_100]]))","v":""}]
["Lolland-Falster","Husdyrproduktion","4",{"$f":"_xlfn.IFS(Tabel1[[#This Row],[FTO_jb]]=\"1\",\"JB1&3\",Tabel1[[#This Row],[FTO_jb]]=\"2\",\"JB2&4\",Tabel1[[#This Row],[FTO_jb]]=\"3\",\"JB5&6\",Tabel1[[#This Row],[FTO_jb]]=\"4\",\"JB7&8\",Tabel1[[#This Row],[FTO_jb]]=\"Alle\",Tabel1[[#This Row],[FTO_jb]])","v":"JB7&8"},12,"NaN",{"$f":"IF(Tabel1[[#This Row],[x.MQ00_20]]=\"NaN\",\"\",VALUE(Tabel1[[#This Row],[x.MQ00_20]]))","v":""},"NaN",{"$f":"IF(Tabel1[[#This Row],[x.MQ20_40]]=\"NaN\",\"\",VALUE(Tabel1[[#This Row],[x.MQ20_40]]))","v":""},"NaN",{"$f":"IF(Tabel1[[#This Row],[x.MQ40_60]]=\"NaN\",\"\",VALUE(Tabel1[[#This Row],[x.MQ40_60]]))","v":""},"NaN",{"$f":"IF(Tabel1[[#This Row],[x.MQ60_80]]=\"NaN\",\"\",VALUE(Tabel1[[#This Row],[x.MQ60_80]]))","v":""},"NaN",{"$f":"IF(Tabel1[[#This Row],[x.MQ80_100]]=\"NaN\",\"\",VALUE(Tabel1[[#This Row],[x.MQ80_100]]))","v":""}]
["Lolland-Falster","Planteavl","1",{"$f":"_xlfn.IFS(Tabel1[[#This Row],[FTO_jb]]=\"1\",\"JB1&3\",Tabel1[[#This Row],[FTO_jb]]=\"2\",\"JB2&4\",Tabel1[[#This Row],[FTO_jb]]=\"3\",\"JB5&6\",Tabel1[[#This Row],[FTO_jb]]=\"4\",\"JB7&8\",Tabel1[[#This Row],[FTO_jb]]=\"Alle\",Tabel1[[#This Row],[FTO_jb]])","v":"JB1&3"},1,"NaN",{"$f":"IF(Tabel1[[#This Row],[x.MQ00_20]]=\"NaN\",\"\",VALUE(Tabel1[[#This Row],[x.MQ00_20]]))","v":""},"NaN",{"$f":"IF(Tabel1[[#This Row],[x.MQ20_40]]=\"NaN\",\"\",VALUE(Tabel1[[#This Row],[x.MQ20_40]]))","v":""},"NaN",{"$f":"IF(Tabel1[[#This Row],[x.MQ40_60]]=\"NaN\",\"\",VALUE(Tabel1[[#This Row],[x.MQ40_60]]))","v":""},"NaN",{"$f":"IF(Tabel1[[#This Row],[x.MQ60_80]]=\"NaN\",\"\",VALUE(Tabel1[[#This Row],[x.MQ60_80]]))","v":""},"NaN",{"$f":"IF(Tabel1[[#This Row],[x.MQ80_100]]=\"NaN\",\"\",VALUE(Tabel1[[#This Row],[x.MQ80_100]]))","v":""}]
["Lolland-Falster","Planteavl","2",{"$f":"_xlfn.IFS(Tabel1[[#This Row],[FTO_jb]]=\"1\",\"JB1&3\",Tabel1[[#This Row],[FTO_jb]]=\"2\",\"JB2&4\",Tabel1[[#This Row],[FTO_jb]]=\"3\",\"JB5&6\",Tabel1[[#This Row],[FTO_jb]]=\"4\",\"JB7&8\",Tabel1[[#This Row],[FTO_jb]]=\"Alle\",Tabel1[[#This Row],[FTO_jb]])","v":"JB2&4"},6,"NaN",{"$f":"IF(Tabel1[[#This Row],[x.MQ00_20]]=\"NaN\",\"\",VALUE(Tabel1[[#This Row],[x.MQ00_20]]))","v":""},"NaN",{"$f":"IF(Tabel1[[#This Row],[x.MQ20_40]]=\"NaN\",\"\",VALUE(Tabel1[[#This Row],[x.MQ20_40]]))","v":""},"NaN",{"$f":"IF(Tabel1[[#This Row],[x.MQ40_60]]=\"NaN\",\"\",VALUE(Tabel1[[#This Row],[x.MQ40_60]]))","v":""},"NaN",{"$f":"IF(Tabel1[[#This Row],[x.MQ60_80]]=\"NaN\",\"\",VALUE(Tabel1[[#This Row],[x.MQ60_80]]))","v":""},"NaN",{"$f":"IF(Tabel1[[#This Row],[x.MQ80_100]]=\"NaN\",\"\",VALUE(Tabel1[[#This Row],[x.MQ80_100]]))","v":""}]
["Lolland-Falster","Planteavl","3",{"$f":"_xlfn.IFS(Tabel1[[#This Row],[FTO_jb]]=\"1\",\"JB1&3\",Tabel1[[#This Row],[FTO_jb]]=\"2\",\"JB2&4\",Tabel1[[#This Row],[FTO_jb]]=\"3\",\"JB5&6\",Tabel1[[#This Row],[FTO_jb]]=\"4\",\"JB7&8\",Tabel1[[#This Row],[FTO_jb]]=\"Alle\",Tabel1[[#This Row],[FTO_jb]])","v":"JB5&6"},39,"NaN",{"$f":"IF(Tabel1[[#This Row],[x.MQ00_20]]=\"NaN\",\"\",VALUE(Tabel1[[#This Row],[x.MQ00_20]]))","v":""},"NaN",{"$f":"IF(Tabel1[[#This Row],[x.MQ20_40]]=\"NaN\",\"\",VALUE(Tabel1[[#This Row],[x.MQ20_40]]))","v":""},"NaN",{"$f":"IF(Tabel1[[#This Row],[x.MQ40_60]]=\"NaN\",\"\",VALUE(Tabel1[[#This Row],[x.MQ40_60]]))","v":""},"NaN",{"$f":"IF(Tabel1[[#This Row],[x.MQ60_80]]=\"NaN\",\"\",VALUE(Tabel1[[#This Row],[x.MQ60_80]]))","v":""},"NaN",{"$f":"IF(Tabel1[[#This Row],[x.MQ80_100]]=\"NaN\",\"\",VALUE(Tabel1[[#This Row],[x.MQ80_100]]))","v":""}]
["Lolland-Falster","Planteavl","4",{"$f":"_xlfn.IFS(Tabel1[[#This Row],[FTO_jb]]=\"1\",\"JB1&3\",Tabel1[[#This Row],[FTO_jb]]=\"2\",\"JB2&4\",Tabel1[[#This Row],[FTO_jb]]=\"3\",\"JB5&6\",Tabel1[[#This Row],[FTO_jb]]=\"4\",\"JB7&8\",Tabel1[[#This Row],[FTO_jb]]=\"Alle\",Tabel1[[#This Row],[FTO_jb]])","v":"JB7&8"},36,"NaN",{"$f":"IF(Tabel1[[#This Row],[x.MQ00_20]]=\"NaN\",\"\",VALUE(Tabel1[[#This Row],[x.MQ00_20]]))","v":""},"NaN",{"$f":"IF(Tabel1[[#This Row],[x.MQ20_40]]=\"NaN\",\"\",VALUE(Tabel1[[#This Row],[x.MQ20_40]]))","v":""},"NaN",{"$f":"IF(Tabel1[[#This Row],[x.MQ40_60]]=\"NaN\",\"\",VALUE(Tabel1[[#This Row],[x.MQ40_60]]))","v":""},"NaN",{"$f":"IF(Tabel1[[#This Row],[x.MQ60_80]]=\"NaN\",\"\",VALUE(Tabel1[[#This Row],[x.MQ60_80]]))","v":""},"NaN",{"$f":"IF(Tabel1[[#This Row],[x.MQ80_100]]=\"NaN\",\"\",VALUE(Tabel1[[#This Row],[x.MQ80_100]]))","v":""}]
["Nordjylland","Husdyrproduktion","1",{"$f":"_xlfn.IFS(Tabel1[[#This Row],[FTO_jb]]=\"1\",\"JB1&3\",Tabel1[[#This Row],[FTO_jb]]=\"2\",\"JB2&4\",Tabel1[[#This Row],[FTO_jb]]=\"3\",\"JB5&6\",Tabel1[[#This Row],[FTO_jb]]=\"4\",\"JB7&8\",Tabel1[[#This Row],[FTO_jb]]=\"Alle\",Tabel1[[#This Row],[FTO_jb]])","v":"JB1&3"},74,"2114",{"$f":"IF(Tabel1[[#This Row],[x.MQ00_20]]=\"NaN\",\"\",VALUE(Tabel1[[#This Row],[x.MQ00_20]]))","v":2114},"3367",{"$f":"IF(Tabel1[[#This Row],[x.MQ20_40]]=\"NaN\",\"\",VALUE(Tabel1[[#This Row],[x.MQ20_40]]))","v":3367},"3877",{"$f":"IF(Tabel1[[#This Row],[x.MQ40_60]]=\"NaN\",\"\",VALUE(Tabel1[[#This Row],[x.MQ40_60]]))","v":3877},"4515",{"$f":"IF(Tabel1[[#This Row],[x.MQ60_80]]=\"NaN\",\"\",VALUE(Tabel1[[#This Row],[x.MQ60_80]]))","v":4515},"5764",{"$f":"IF(Tabel1[[#This Row],[x.MQ80_100]]=\"NaN\",\"\",VALUE(Tabel1[[#This Row],[x.MQ80_100]]))","v":5764}]
["Nordjylland","Husdyrproduktion","2",{"$f":"_xlfn.IFS(Tabel1[[#This Row],[FTO_jb]]=\"1\",\"JB1&3\",Tabel1[[#This Row],[FTO_jb]]=\"2\",\"JB2&4\",Tabel1[[#This Row],[FTO_jb]]=\"3\",\"JB5&6\",Tabel1[[#This Row],[FTO_jb]]=\"4\",\"JB7&8\",Tabel1[[#This Row],[FTO_jb]]=\"Alle\",Tabel1[[#This Row],[FTO_jb]])","v":"JB2&4"},391,"2038",{"$f":"IF(Tabel1[[#This Row],[x.MQ00_20]]=\"NaN\",\"\",VALUE(Tabel1[[#This Row],[x.MQ00_20]]))","v":2038},"3322",{"$f":"IF(Tabel1[[#This Row],[x.MQ20_40]]=\"NaN\",\"\",VALUE(Tabel1[[#This Row],[x.MQ20_40]]))","v":3322},"3902",{"$f":"IF(Tabel1[[#This Row],[x.MQ40_60]]=\"NaN\",\"\",VALUE(Tabel1[[#This Row],[x.MQ40_60]]))","v":3902},"4524",{"$f":"IF(Tabel1[[#This Row],[x.MQ60_80]]=\"NaN\",\"\",VALUE(Tabel1[[#This Row],[x.MQ60_80]]))","v":4524},"5890",{"$f":"IF(Tabel1[[#This Row],[x.MQ80_100]]=\"NaN\",\"\",VALUE(Tabel1[[#This Row],[x.MQ80_100]]))","v":5890}]
{"$rows_left_out":77}